{"text_format":"1","workbook":"xlsx","n_sheets":5,"sheets":["CHART","บันทึกรายวัน","db","ผังระบบ GFMIS","งบทดลอง GFMIS"],"not_rendered":{"charts":0,"images":13,"macros":1,"external_links":1,"defined_names":4,"comments":1,"pivot_tables":0},"unopened":[],"bounds":{"document_bytes":16777216,"sheet_cells":100000,"rows_first":2000,"rows_last":500,"rows_between":2000,"halvings":0,"cell_chars":16384,"cell_head_chars":4096},"cells_cut":0,"cells_raw":0,"read":"whole","date_system":"1900"}

{"sheet":"CHART","index":0,"n_rows":102,"n_cols":10,"rows_kept":102,"cut":false,"hidden":false,"merged":[]}
["เลขที่บัญชี","ชื่อบัญชี","หมวด","ชื่อหมวด","ยอดยกมา Dr.","ยอดยกมา Cr."]
[1101010101,"เงินสดในมือ(GFMIS)",{"$f":"LEFT(A2,1)","v":"1"},{"$f":"IF(C2=\"1\",\"สินทรัพย์\",IF(C2=\"2\",\"หนี้สิน\",IF(C2=\"3\",\"ส่วนของเจ้าของ\",IF(C2=\"4\",\"รายได้\",IF(C2=\"5\",\"ค่าใช้จ่าย\",\"N/A\")))))","v":"สินทรัพย์"},null,null,null,null,null,"บัญชีคุม"]
[11010,"เงินสดในมือ",1,"สินทรัพย์"]
[1101030112,"เงินฝาก-Interface(GFMIS)","1","สินทรัพย์",null,null,null,null,null,"บัญชีคุม"]
[11020,"เงินฝาก- ออมทรัพย์ธนาคารกรุงเทพ-0423",1,"สินทรัพย์"]
[11021,"เงินฝาก- กระแสรายวันธนาคารกรุงศรี-0042",1,"สินทรัพย์"]
[1102050107,"รายได้ค้างรับ-ภายนอก(GFMIS)",1,"สินทรัพย์",null,null,null,null,null,"บัญชีคุม"]
[11030,"รายได้ค้างรับ",1,"สินทรัพย์"]
[1101030112,"ลูกหนี้เงินมัดจำ(GFMIS)",1,"สินทรัพย์",null,null,null,null,null,"บัญชีคุม"]
[12010,"ลูกหนี้เงินมัดจำ-ประกันผลงาน ",1,"สินทรัพย์"]
[1102050194,"ลูกหนี้อื่น-ภายนอก(GFMIS)",1,"สินทรัพย์",null,null,null,null,null,"บัญชีคุม"]
[12020,"ลูกหนี้อื่น-ภายนอก",1,"สินทรัพย์"]
[1103020111,"เงินจ่ายล่วงหน้า(GFMIS) ",1,"สินทรัพย์",null,null,null,null,null,"บัญชีคุม"]
[12030,"เงินจ่ายล่วงหน้า ",1,"สินทรัพย์"]
[1104010104,"เงินฝากประจำ-Inf(GFMIS)",1,"สินทรัพย์",null,null,null,null,null,"บัญชีคุม"]
[12040,"เงินฝากประจำ-ธนาคารกรุงเทพ-0459",1,"สินทรัพย์"]
[1105010105,"วัสดุคงเหลือ(GFMIS)",1,"สินทรัพย์",null,null,null,null,null,"บัญชีคุม"]
[12050,"วัสดุคงเหลือ",1,"สินทรัพย์"]
[1204030101,"ที่ดิน-Interface(GFMIS)",1,"สินทรัพย์",null,null,null,null,null,"บัญชีคุม"]
[14010,"ที่ดิน",1,"สินทรัพย์"]
[1205050101,"อาคารและสิ่งปลูกสร้าง (GFMIS)",1,"สินทรัพย์"]
[14020,"อาคารและสิ่งปลูกสร้าง ",1,"สินทรัพย์"]
[1205050102,"ค่าเสื่อมราคา-อาคารและสิ่งปลูกสร้าง(GFMIS) ",1,"สินทรัพย์",null,null,null,null,null,"บัญชีคุม"]
[14030,"ค่าเสีอมราคา-อาคารและสิ่งปลูกสร้าง ",1,"สินทรัพย์"]
[1206170101,"ครุภัณฑ์-Interface(GFMIS)",{"$f":"LEFT(A25,1)","v":"1"},{"$f":"IF(C25=\"1\",\"สินทรัพย์\",IF(C25=\"2\",\"หนี้สิน\",IF(C25=\"3\",\"ส่วนของเจ้าของ\",IF(C25=\"4\",\"รายได้\",IF(C25=\"5\",\"ค่าใช้จ่าย\",\"N/A\")))))","v":"สินทรัพย์"},null,null,null,null,null,"บัญชีคุม"]
[14040,"ครุภัณฑ์-คอมพิวเตอร์",{"$f":"LEFT(A26,1)","v":"1"},{"$f":"IF(C26=\"1\",\"สินทรัพย์\",IF(C26=\"2\",\"หนี้สิน\",IF(C26=\"3\",\"ส่วนของเจ้าของ\",IF(C26=\"4\",\"รายได้\",IF(C26=\"5\",\"ค่าใช้จ่าย\",\"N/A\")))))","v":"สินทรัพย์"}]
[14041,"ครุภัณฑ์-สำนักงาน","1",{"$f":"IF(C27=\"1\",\"สินทรัพย์\",IF(C27=\"2\",\"หนี้สิน\",IF(C27=\"3\",\"ส่วนของเจ้าของ\",IF(C27=\"4\",\"รายได้\",IF(C27=\"5\",\"ค่าใช้จ่าย\",\"N/A\")))))","v":"สินทรัพย์"}]
[14042,"ครุภัณฑ์-ไฟฟ้าและวิทยุ","1","สินทรัพย์"]
[14043,"ครุภัณฑ์-โฆษณาและเผยแพร่","1","สินทรัพย์"]
[1206170102,"ค่าเสื่อมราคาสะสม-ครุภัณฑ์ Interface(GFMIS)","1","สินทรัพย์",null,null,null,null,null,"บัญชีคุม"]
[14050,"ค่าเสื่อมราคาสะสม-ครุภัณฑ์-คอมพิวเตอร์",{"$f":"LEFT(A31,1)","v":"1"},{"$f":"IF(C31=\"1\",\"สินทรัพย์\",IF(C31=\"2\",\"หนี้สิน\",IF(C31=\"3\",\"ส่วนของเจ้าของ\",IF(C31=\"4\",\"รายได้\",IF(C31=\"5\",\"ค่าใช้จ่าย\",\"N/A\")))))","v":"สินทรัพย์"}]
[14051,"ค่าเสื่อมราคาสะสม-ครุภัณฑ์-สำนักงาน","1","สินทรัพย์"]
[14052,"ค่าเสื่อมราคาสะสม-ครุภัณฑ์-ไฟฟ้าและวิทยุ","1","สินทรัพย์"]
[14053,"ค่าเสีอมราคาสะสม-ครุภัณฑ์-โฆษณาและเผยแพร่","1","สินทรัพย์"]
[1209030101,"สินทรัพย์ไม่มีตัวตน-Inf(GFMIS)","1","สินทรัพย์",null,null,null,null,null,"บัญชีคุม"]
[14060,"โปรแกรมคอมพิวเตอร์ ","1","สินทรัพย์"]
[1209030102,"ค่าตัดจำหน่าย-สินทรัพย์ไม่มีตัวตน-Inf(GFMIS)","1","สินทรัพย์",null,null,null,null,null,"บัญชีคุม"]
[14070,"ค่าตัดจำหน่าย-สินทรัพย์ไม่มีตัวตน-Inf","1","สินทรัพย์"]
[1211010103,"งานระหว่างสร้าง-Inf(GFMIS)","1","สินทรัพย์",null,null,null,null,null,"บัญชีคุม"]
[14080,"งานระหว่างก่อสร้าง ","1","สินทรัพย์"]
[1213010103,"ค่าใช้จ่ายรอตัดบัญชี(GFMIS)","1","สินทรัพย์",null,null,null,null,null,"บัญชีคุม"]
[14090,"ค่าใช้จ่ายรอตัดบัญชี","1","สินทรัพย์"]
[2101010107,"เจ้าหนี้การค้า-Inf ภายนอก(GFMIS)","2","หนี้สิน",null,null,null,null,null,"บัญชีคุม"]
[21010,"เจ้าหนี้การค้า-นาย ก","2","หนี้สิน"]
[21011,"เจ้าหนี้การค้า-นาย ข","2","หนี้สิน"]
[21012,"เจ้าหนี้การค้า-นาย ค","2","หนี้สิน"]
[2112010199,"เงินประกันอื่น (GFMIS)","2","หนี้สิน",null,null,null,null,null,"บัญชีคุม"]
[21020,"เงินประกันอื่น ","2","หนี้สิน"]
[2116010199,"หนี้สินหมุนเวียนอื่น (GFMIS)","2","หนี้สิน",null,null,null,null,null,"บัญชีคุม"]
[21030,"หนี้สินหมุนเวียนอื่น ","2","หนี้สิน"]
[2213010101,"รายได้รอการรับรู้(GFMIS)","2","หนี้สิน",null,null,null,null,null,"บัญชีคุม"]
[21040,"รายได้รอการรับรู้","2","หนี้สิน"]
[3101010101,"รายได้สูงต่ำกว่าค่าใช้จ่ายสุทธิ(GFMIS)","3","ส่วนของเจ้าของ",null,null,null,null,null,"บัญชีคุม"]
[31010,"รายได้สูงต่ำกว่าค่าใช้จ่ายสุทธิ","3","ส่วนของเจ้าของ"]
[3102010101,"รายได้สูงต่ำกว่าค่าใช้จ่ายสะสม (GFMIS)","3","ส่วนของเจ้าของ",null,null,null,null,null,"บัญชีคุม"]
[31020,"รายได้สูงต่ำกว่าค่าใช้จ่ายสะสม ","3","ส่วนของเจ้าของ"]
[4301020102,"รายได้จากการให้บริการบุคคลภายนอก(GFMIS)","4","รายได้",null,null,null,null,null,"บัญชีคุม"]
[41010,"รายได้อื่น-รายได้บริหารจัดการ",{"$f":"LEFT(A58,1)","v":"4"},{"$f":"IF(C58=\"1\",\"สินทรัพย์\",IF(C58=\"2\",\"หนี้สิน\",IF(C58=\"3\",\"ส่วนของเจ้าของ\",IF(C58=\"4\",\"รายได้\",IF(C58=\"5\",\"ค่าใช้จ่าย\",\"N/A\")))))","v":"รายได้"}]
[41011,"รายได้อื่น-รายได้เข้าโครงการ",{"$f":"LEFT(A59,1)","v":"4"},{"$f":"IF(C59=\"1\",\"สินทรัพย์\",IF(C59=\"2\",\"หนี้สิน\",IF(C59=\"3\",\"ส่วนของเจ้าของ\",IF(C59=\"4\",\"รายได้\",IF(C59=\"5\",\"ค่าใช้จ่าย\",\"N/A\")))))","v":"รายได้"}]
[41012,"รายได้ดอกเบี้ยเงินฝากธนาคาร ",{"$f":"LEFT(A60,1)","v":"4"},{"$f":"IF(C60=\"1\",\"สินทรัพย์\",IF(C60=\"2\",\"หนี้สิน\",IF(C60=\"3\",\"ส่วนของเจ้าของ\",IF(C60=\"4\",\"รายได้\",IF(C60=\"5\",\"ค่าใช้จ่าย\",\"N/A\")))))","v":"รายได้"}]
[41013,"รายได้อื่น ","4","รายได้"]
[5104030205,"ต้นทุนขาย-สินค้าและบริการ(GFMIS)",{"$f":"LEFT(A62,1)","v":"5"},{"$f":"IF(C62=\"1\",\"สินทรัพย์\",IF(C62=\"2\",\"หนี้สิน\",IF(C62=\"3\",\"ส่วนของเจ้าของ\",IF(C62=\"4\",\"รายได้\",IF(C62=\"5\",\"ค่าใช้จ่าย\",\"N/A\")))))","v":"ค่าใช้จ่าย"},null,null,null,null,null,"บัญชีคุม"]
[51100,"เงินเดือนและค่าจ้าง(บัญชีคุม)","5","ค่าใช้จ่าย",null,null,null,null,null,"บัญชีคุม"]
[51101,"เงินเดือน","5","ค่าใช้จ่าย"]
[51200,"ค่าตอบแทน(บัญชีคุม)","5","ค่าใช้จ่าย",null,null,null,null,null,"บัญชีคุม"]
[51201,"ค่าตอบแทนกรรมการ",{"$f":"LEFT(A66,1)","v":"5"},{"$f":"IF(C66=\"1\",\"สินทรัพย์\",IF(C66=\"2\",\"หนี้สิน\",IF(C66=\"3\",\"ส่วนของเจ้าของ\",IF(C66=\"4\",\"รายได้\",IF(C66=\"5\",\"ค่าใช้จ่าย\",\"N/A\")))))","v":"ค่าใช้จ่าย"}]
[51202,"ค่าตอบแทนวิทยากร","5","ค่าใช้จ่าย"]
[51203,"ค่าตอบแทนนักศึกษาช่วยงาน ","5","ค่าใช้จ่าย"]
[51204,"ค่าตอบแทนการปฏิบัติงาน","5","ค่าใช้จ่าย"]
[51205,"ค่าตอบแทนล่วงเวลา","5","ค่าใช้จ่าย"]
[51206,"ค่าตอบแทนอื่นๆ","5","ค่าใช้จ่าย"]
[51300,"ค่าวัสดุ(บัญชีคุม)","5","ค่าใช้จ่าย",null,null,null,null,null,"บัญชีคุม"]
[51301,"ค่าวัสดุอื่นๆ",{"$f":"LEFT(A73,1)","v":"5"},{"$f":"IF(C73=\"1\",\"สินทรัพย์\",IF(C73=\"2\",\"หนี้สิน\",IF(C73=\"3\",\"ส่วนของเจ้าของ\",IF(C73=\"4\",\"รายได้\",IF(C73=\"5\",\"ค่าใช้จ่าย\",\"N/A\")))))","v":"ค่าใช้จ่าย"}]
[51302,"ค่าน้ำมันเชื้อเพลิง","5","ค่าใช้จ่าย"]
[51303,"ครุภัณฑ์ต่ำกว่าเกณฑ์","5","ค่าใช้จ่าย"]
[51304,"ค่าของที่ระลึก","5","ค่าใช้จ่าย"]
[51400,"ค่าใช้สอย(บัญชีคุม)","5","ค่าใช้จ่าย",null,null,null,null,null,"บัญชีคุม"]
[51401,"ค่าเช่าห้อง/ค่าตกแต่ง",{"$f":"LEFT(A78,1)","v":"5"},{"$f":"IF(C78=\"1\",\"สินทรัพย์\",IF(C78=\"2\",\"หนี้สิน\",IF(C78=\"3\",\"ส่วนของเจ้าของ\",IF(C78=\"4\",\"รายได้\",IF(C78=\"5\",\"ค่าใช้จ่าย\",\"N/A\")))))","v":"ค่าใช้จ่าย"}]
[51402,"ค่าเช่าเบ็ดเตล็ด","5","ค่าใช้จ่าย"]
[51403,"ค่าอาหารและเครื่องดื่ม ","5","ค่าใช้จ่าย"]
{"$rows_left_out":23}
{"sheet":"บันทึกรายวัน","index":1,"n_rows":39,"n_cols":10,"rows_kept":39,"cut":false,"hidden":false,"merged":[[5,1,5,3],[2,1,2,3],[3,1,3,3],[4,1,4,3]]}
["ใบสำคัญบันทึกบัญชี",null,null,null,null,null,null,"status",0]
[]
["เลขที่รายการ"]
["วันที่","2017-05-25"]
["อ้างอิงเอกสาร"]
["คำอธิบาย"]
[]
["เลขที่บัญชี","ชื่อบัญชี","DR.","CR.","ชื่อบัญชี","จน.เงิน","ค่าว่าง",null,null,"ยอดคงเหลือ"]
[null,{"$f":"IF(ISNA(VLOOKUP(A9,CHART!A:D,2,FALSE)),\"\",VLOOKUP(A9,CHART!A:D,2,FALSE))","v":""},null,null,{"$f":"ISNA(VLOOKUP(A9,CHART!A:D,2,FALSE))","v":true},{"$f":"IF(AND(C9>0,D9>0),TRUE,FALSE)","v":false},{"$f":"IF(AND(C9=\"\",D9=\"\"),TRUE,FALSE)","v":true},{"$f":"+E9+F9+G9","v":2},null,{"$f":"SUMIF(db!E:H,A9,db!G:G)-SUMIF(db!E:H,A9,db!H:H)+SUMIF(CHART!A:F,บันทึกรายวัน!A9,CHART!E:E)-SUMIF(CHART!A:F,บันทึกรายวัน!A9,CHART!F:F)","v":0}]
[null,{"$f":"IF(ISNA(VLOOKUP(A10,CHART!A:D,2,FALSE)),\"\",VLOOKUP(A10,CHART!A:D,2,FALSE))","v":""},null,null,{"$f":"ISNA(VLOOKUP(A10,CHART!A:D,2,FALSE))","v":true},{"$f":"IF(AND(C10>0,D10>0,C10=D10),TRUE,FALSE)","v":false},{"$f":"IF(AND(C10=\"\",D10=\"\"),TRUE,FALSE)","v":true},{"$f":"+E10+F10+G10","v":2},null,{"$f":"SUMIF(db!E:H,A10,db!G:G)-SUMIF(db!E:H,A10,db!H:H)+SUMIF(CHART!A:F,บันทึกรายวัน!A10,CHART!E:E)-SUMIF(CHART!A:F,บันทึกรายวัน!A10,CHART!F:F)","v":0}]
[null,{"$f":"IF(ISNA(VLOOKUP(A11,CHART!A:D,2,FALSE)),\"\",VLOOKUP(A11,CHART!A:D,2,FALSE))","v":""},null,null,{"$f":"ISNA(VLOOKUP(A11,CHART!A:D,2,FALSE))","v":true},{"$f":"IF(AND(C11>0,D11>0,C11=D11),TRUE,FALSE)","v":false},true,2,null,{"$f":"SUMIF(db!E:H,A11,db!G:G)-SUMIF(db!E:H,A11,db!H:H)+SUMIF(CHART!A:F,บันทึกรายวัน!A11,CHART!E:E)-SUMIF(CHART!A:F,บันทึกรายวัน!A11,CHART!F:F)","v":0}]
[null,{"$f":"IF(ISNA(VLOOKUP(A12,CHART!A:D,2,FALSE)),\"\",VLOOKUP(A12,CHART!A:D,2,FALSE))","v":""},null,null,{"$f":"ISNA(VLOOKUP(A12,CHART!A:D,2,FALSE))","v":true},{"$f":"IF(AND(C12>0,D12>0,C12=D12),TRUE,FALSE)","v":false},true,2,null,{"$f":"SUMIF(db!E:H,A12,db!G:G)-SUMIF(db!E:H,A12,db!H:H)+SUMIF(CHART!A:F,บันทึกรายวัน!A12,CHART!E:E)-SUMIF(CHART!A:F,บันทึกรายวัน!A12,CHART!F:F)","v":0}]
[null,{"$f":"IF(ISNA(VLOOKUP(A13,CHART!A:D,2,FALSE)),\"\",VLOOKUP(A13,CHART!A:D,2,FALSE))","v":""},null,null,{"$f":"ISNA(VLOOKUP(A13,CHART!A:D,2,FALSE))","v":true},{"$f":"IF(AND(C13>0,D13>0),TRUE,FALSE)","v":false},true,2,null,{"$f":"SUMIF(db!E:H,A13,db!G:G)-SUMIF(db!E:H,A13,db!H:H)+SUMIF(CHART!A:F,บันทึกรายวัน!A13,CHART!E:E)-SUMIF(CHART!A:F,บันทึกรายวัน!A13,CHART!F:F)","v":0}]
[null,{"$f":"IF(ISNA(VLOOKUP(A14,CHART!A:D,2,FALSE)),\"\",VLOOKUP(A14,CHART!A:D,2,FALSE))","v":""},null,null,{"$f":"ISNA(VLOOKUP(A14,CHART!A:D,2,FALSE))","v":true},false,true,2,null,{"$f":"SUMIF(db!E:H,A14,db!G:G)-SUMIF(db!E:H,A14,db!H:H)+SUMIF(CHART!A:F,บันทึกรายวัน!A14,CHART!E:E)-SUMIF(CHART!A:F,บันทึกรายวัน!A14,CHART!F:F)","v":0}]
[null,{"$f":"IF(ISNA(VLOOKUP(A15,CHART!A:D,2,FALSE)),\"\",VLOOKUP(A15,CHART!A:D,2,FALSE))","v":""},null,null,{"$f":"ISNA(VLOOKUP(A15,CHART!A:D,2,FALSE))","v":true},false,true,2,null,{"$f":"SUMIF(db!E:H,A15,db!G:G)-SUMIF(db!E:H,A15,db!H:H)+SUMIF(CHART!A:F,บันทึกรายวัน!A15,CHART!E:E)-SUMIF(CHART!A:F,บันทึกรายวัน!A15,CHART!F:F)","v":0}]
[null,{"$f":"IF(ISNA(VLOOKUP(A16,CHART!A:D,2,FALSE)),\"\",VLOOKUP(A16,CHART!A:D,2,FALSE))","v":""},null,null,{"$f":"ISNA(VLOOKUP(A16,CHART!A:D,2,FALSE))","v":true},false,true,2,null,{"$f":"SUMIF(db!E:H,A16,db!G:G)-SUMIF(db!E:H,A16,db!H:H)+SUMIF(CHART!A:F,บันทึกรายวัน!A16,CHART!E:E)-SUMIF(CHART!A:F,บันทึกรายวัน!A16,CHART!F:F)","v":0}]
[null,{"$f":"IF(ISNA(VLOOKUP(A17,CHART!A:D,2,FALSE)),\"\",VLOOKUP(A17,CHART!A:D,2,FALSE))","v":""},null,null,{"$f":"ISNA(VLOOKUP(A17,CHART!A:D,2,FALSE))","v":true},false,true,2,null,{"$f":"SUMIF(db!E:H,A17,db!G:G)-SUMIF(db!E:H,A17,db!H:H)+SUMIF(CHART!A:F,บันทึกรายวัน!A17,CHART!E:E)-SUMIF(CHART!A:F,บันทึกรายวัน!A17,CHART!F:F)","v":0}]
[null,{"$f":"IF(ISNA(VLOOKUP(A18,CHART!A:D,2,FALSE)),\"\",VLOOKUP(A18,CHART!A:D,2,FALSE))","v":""},null,null,{"$f":"ISNA(VLOOKUP(A18,CHART!A:D,2,FALSE))","v":true},false,true,2,null,{"$f":"SUMIF(db!E:H,A18,db!G:G)-SUMIF(db!E:H,A18,db!H:H)+SUMIF(CHART!A:F,บันทึกรายวัน!A18,CHART!E:E)-SUMIF(CHART!A:F,บันทึกรายวัน!A18,CHART!F:F)","v":0}]
[null,{"$f":"IF(ISNA(VLOOKUP(A19,CHART!A:D,2,FALSE)),\"\",VLOOKUP(A19,CHART!A:D,2,FALSE))","v":""},null,null,{"$f":"ISNA(VLOOKUP(A19,CHART!A:D,2,FALSE))","v":true},false,true,2,null,{"$f":"SUMIF(db!E:H,A19,db!G:G)-SUMIF(db!E:H,A19,db!H:H)+SUMIF(CHART!A:F,บันทึกรายวัน!A19,CHART!E:E)-SUMIF(CHART!A:F,บันทึกรายวัน!A19,CHART!F:F)","v":0}]
[null,{"$f":"IF(ISNA(VLOOKUP(A20,CHART!A:D,2,FALSE)),\"\",VLOOKUP(A20,CHART!A:D,2,FALSE))","v":""},null,null,{"$f":"ISNA(VLOOKUP(A20,CHART!A:D,2,FALSE))","v":true},false,true,2,null,{"$f":"SUMIF(db!E:H,A20,db!G:G)-SUMIF(db!E:H,A20,db!H:H)+SUMIF(CHART!A:F,บันทึกรายวัน!A20,CHART!E:E)-SUMIF(CHART!A:F,บันทึกรายวัน!A20,CHART!F:F)","v":0}]
[null,{"$f":"IF(ISNA(VLOOKUP(A21,CHART!A:D,2,FALSE)),\"\",VLOOKUP(A21,CHART!A:D,2,FALSE))","v":""},null,null,{"$f":"ISNA(VLOOKUP(A21,CHART!A:D,2,FALSE))","v":true},false,true,2,null,{"$f":"SUMIF(db!E:H,A21,db!G:G)-SUMIF(db!E:H,A21,db!H:H)+SUMIF(CHART!A:F,บันทึกรายวัน!A21,CHART!E:E)-SUMIF(CHART!A:F,บันทึกรายวัน!A21,CHART!F:F)","v":0}]
[null,{"$f":"IF(ISNA(VLOOKUP(A22,CHART!A:D,2,FALSE)),\"\",VLOOKUP(A22,CHART!A:D,2,FALSE))","v":""},null,null,{"$f":"ISNA(VLOOKUP(A22,CHART!A:D,2,FALSE))","v":true},false,true,2,null,{"$f":"SUMIF(db!E:H,A22,db!G:G)-SUMIF(db!E:H,A22,db!H:H)+SUMIF(CHART!A:F,บันทึกรายวัน!A22,CHART!E:E)-SUMIF(CHART!A:F,บันทึกรายวัน!A22,CHART!F:F)","v":0}]
[null,{"$f":"IF(ISNA(VLOOKUP(A23,CHART!A:D,2,FALSE)),\"\",VLOOKUP(A23,CHART!A:D,2,FALSE))","v":""},null,null,{"$f":"ISNA(VLOOKUP(A23,CHART!A:D,2,FALSE))","v":true},false,true,2,null,{"$f":"SUMIF(db!E:H,A23,db!G:G)-SUMIF(db!E:H,A23,db!H:H)+SUMIF(CHART!A:F,บันทึกรายวัน!A23,CHART!E:E)-SUMIF(CHART!A:F,บันทึกรายวัน!A23,CHART!F:F)","v":0}]
[null,{"$f":"IF(ISNA(VLOOKUP(A24,CHART!A:D,2,FALSE)),\"\",VLOOKUP(A24,CHART!A:D,2,FALSE))","v":""},null,null,{"$f":"ISNA(VLOOKUP(A24,CHART!A:D,2,FALSE))","v":true},false,true,2,null,{"$f":"SUMIF(db!E:H,A24,db!G:G)-SUMIF(db!E:H,A24,db!H:H)+SUMIF(CHART!A:F,บันทึกรายวัน!A24,CHART!E:E)-SUMIF(CHART!A:F,บันทึกรายวัน!A24,CHART!F:F)","v":0}]
[null,{"$f":"IF(ISNA(VLOOKUP(A25,CHART!A:D,2,FALSE)),\"\",VLOOKUP(A25,CHART!A:D,2,FALSE))","v":""},null,null,{"$f":"ISNA(VLOOKUP(A25,CHART!A:D,2,FALSE))","v":true},false,true,2,null,{"$f":"SUMIF(db!E:H,A25,db!G:G)-SUMIF(db!E:H,A25,db!H:H)+SUMIF(CHART!A:F,บันทึกรายวัน!A25,CHART!E:E)-SUMIF(CHART!A:F,บันทึกรายวัน!A25,CHART!F:F)","v":0}]
[null,{"$f":"IF(ISNA(VLOOKUP(A26,CHART!A:D,2,FALSE)),\"\",VLOOKUP(A26,CHART!A:D,2,FALSE))","v":""},null,null,{"$f":"ISNA(VLOOKUP(A26,CHART!A:D,2,FALSE))","v":true},false,true,2,null,{"$f":"SUMIF(db!E:H,A26,db!G:G)-SUMIF(db!E:H,A26,db!H:H)+SUMIF(CHART!A:F,บันทึกรายวัน!A26,CHART!E:E)-SUMIF(CHART!A:F,บันทึกรายวัน!A26,CHART!F:F)","v":0}]
[null,{"$f":"IF(ISNA(VLOOKUP(A27,CHART!A:D,2,FALSE)),\"\",VLOOKUP(A27,CHART!A:D,2,FALSE))","v":""},null,null,{"$f":"ISNA(VLOOKUP(A27,CHART!A:D,2,FALSE))","v":true},false,true,2,null,{"$f":"SUMIF(db!E:H,A27,db!G:G)-SUMIF(db!E:H,A27,db!H:H)+SUMIF(CHART!A:F,บันทึกรายวัน!A27,CHART!E:E)-SUMIF(CHART!A:F,บันทึกรายวัน!A27,CHART!F:F)","v":0}]
[null,{"$f":"IF(ISNA(VLOOKUP(A28,CHART!A:D,2,FALSE)),\"\",VLOOKUP(A28,CHART!A:D,2,FALSE))","v":""},null,null,{"$f":"ISNA(VLOOKUP(A28,CHART!A:D,2,FALSE))","v":true},false,true,2,null,{"$f":"SUMIF(db!E:H,A28,db!G:G)-SUMIF(db!E:H,A28,db!H:H)+SUMIF(CHART!A:F,บันทึกรายวัน!A28,CHART!E:E)-SUMIF(CHART!A:F,บันทึกรายวัน!A28,CHART!F:F)","v":0}]
[null,{"$f":"IF(ISNA(VLOOKUP(A29,CHART!A:D,2,FALSE)),\"\",VLOOKUP(A29,CHART!A:D,2,FALSE))","v":""},null,null,{"$f":"ISNA(VLOOKUP(A29,CHART!A:D,2,FALSE))","v":true},false,true,2,null,{"$f":"SUMIF(db!E:H,A29,db!G:G)-SUMIF(db!E:H,A29,db!H:H)+SUMIF(CHART!A:F,บันทึกรายวัน!A29,CHART!E:E)-SUMIF(CHART!A:F,บันทึกรายวัน!A29,CHART!F:F)","v":0}]
[null,{"$f":"IF(ISNA(VLOOKUP(A30,CHART!A:D,2,FALSE)),\"\",VLOOKUP(A30,CHART!A:D,2,FALSE))","v":""},null,null,{"$f":"ISNA(VLOOKUP(A30,CHART!A:D,2,FALSE))","v":true},false,true,2,null,{"$f":"SUMIF(db!E:H,A30,db!G:G)-SUMIF(db!E:H,A30,db!H:H)+SUMIF(CHART!A:F,บันทึกรายวัน!A30,CHART!E:E)-SUMIF(CHART!A:F,บันทึกรายวัน!A30,CHART!F:F)","v":0}]
[null,{"$f":"IF(ISNA(VLOOKUP(A31,CHART!A:D,2,FALSE)),\"\",VLOOKUP(A31,CHART!A:D,2,FALSE))","v":""},null,null,{"$f":"ISNA(VLOOKUP(A31,CHART!A:D,2,FALSE))","v":true},false,true,2,null,{"$f":"SUMIF(db!E:H,A31,db!G:G)-SUMIF(db!E:H,A31,db!H:H)+SUMIF(CHART!A:F,บันทึกรายวัน!A31,CHART!E:E)-SUMIF(CHART!A:F,บันทึกรายวัน!A31,CHART!F:F)","v":0}]
[null,{"$f":"IF(ISNA(VLOOKUP(A32,CHART!A:D,2,FALSE)),\"\",VLOOKUP(A32,CHART!A:D,2,FALSE))","v":""},null,null,{"$f":"ISNA(VLOOKUP(A32,CHART!A:D,2,FALSE))","v":true},false,true,2,null,{"$f":"SUMIF(db!E:H,A32,db!G:G)-SUMIF(db!E:H,A32,db!H:H)+SUMIF(CHART!A:F,บันทึกรายวัน!A32,CHART!E:E)-SUMIF(CHART!A:F,บันทึกรายวัน!A32,CHART!F:F)","v":0}]
[null,{"$f":"IF(ISNA(VLOOKUP(A33,CHART!A:D,2,FALSE)),\"\",VLOOKUP(A33,CHART!A:D,2,FALSE))","v":""},null,null,{"$f":"ISNA(VLOOKUP(A33,CHART!A:D,2,FALSE))","v":true},false,true,2,null,{"$f":"SUMIF(db!E:H,A33,db!G:G)-SUMIF(db!E:H,A33,db!H:H)+SUMIF(CHART!A:F,บันทึกรายวัน!A33,CHART!E:E)-SUMIF(CHART!A:F,บันทึกรายวัน!A33,CHART!F:F)","v":0}]
[null,{"$f":"IF(ISNA(VLOOKUP(A34,CHART!A:D,2,FALSE)),\"\",VLOOKUP(A34,CHART!A:D,2,FALSE))","v":""},null,null,{"$f":"ISNA(VLOOKUP(A34,CHART!A:D,2,FALSE))","v":true},false,true,2,null,{"$f":"SUMIF(db!E:H,A34,db!G:G)-SUMIF(db!E:H,A34,db!H:H)+SUMIF(CHART!A:F,บันทึกรายวัน!A34,CHART!E:E)-SUMIF(CHART!A:F,บันทึกรายวัน!A34,CHART!F:F)","v":0}]
[null,{"$f":"IF(ISNA(VLOOKUP(A35,CHART!A:D,2,FALSE)),\"\",VLOOKUP(A35,CHART!A:D,2,FALSE))","v":""},null,null,{"$f":"ISNA(VLOOKUP(A35,CHART!A:D,2,FALSE))","v":true},false,true,2,null,{"$f":"SUMIF(db!E:H,A35,db!G:G)-SUMIF(db!E:H,A35,db!H:H)+SUMIF(CHART!A:F,บันทึกรายวัน!A35,CHART!E:E)-SUMIF(CHART!A:F,บันทึกรายวัน!A35,CHART!F:F)","v":0}]
["รวมยอด",{"$f":"BAHTTEXT(C36)","v":"ศูนย์บาทถ้วน"},{"$f":"SUM(C9:C35)","v":0},{"$f":"SUM(D9:D35)","v":0},null,null,null,{"$f":"IF(C36=D36,0,1)","v":0}]
[]
["ลงชื่อ............................ผู้ทำบัญชี  ลงชื่อ.................................ตรวจสอบ    ลงชื่อ............................ผู้อนุมัติ"]
["วันที่  .................................           วันที่ ..................................                 วันที่ ............................."]

{"sheet":"db","index":2,"n_rows":1,"n_cols":8,"rows_kept":1,"cut":false,"hidden":false,"merged":[]}
["รหัส","วันที่","เลขเอกสาร","คำอธิบาย","เลขที่บัญชี","ชื่อบัญชี","เดบิต","เครดิต"]

{"sheet":"ผังระบบ GFMIS","index":3,"n_rows":109,"n_cols":5,"rows_kept":109,"cut":false,"hidden":false,"merged":[]}
["สินทรัพย์"]
[null,"สินทรัพย์หมุนเวียน"]
[null,null,"เงินสดและรายการเทียบเท่าเงินสด"]
[null,null,null,1101010101,"เงินสดในมือ"]
[null,null,null,1101030112,"เงินฝาก-Interface"]
[null,null,"ลูกหนี้ระยะสั้น "]
[null,null,null,1102050129,"ลูกหนี้เงินมัดจำ"]
[null,null,null,1102050194,"ลูกหนี้อื่น-ภายนอก"]
[null,null,null,1103020111,"เงินจ่ายล่วงหน้า"]
[null,null,"เงินลงทุนระยะสั้น "]
[null,null,null,1104010104,"เงินฝากประจำ-Inf"]
[null,null,"วัสดุคงเหลือ"]
[null,null,null,1105010105,"วัสดุคงคลัง"]
[null,"สินทรัพย์ไม่หมุนเวียน"]
[null,null,"ที่ดิน อาคารและอุปกรณ์ "]
[null,null,null,1204030101,"ที่ดิน - Interface"]
[null,null,null,1205050101,"อาคาร&สิ่งปลูกสร้าง - Inf"]
[null,null,null,1205050102,"ค่าเสื่อมราคาสะสม-อาคาร&สิ่งปลูกสร้าง-Inf"]
[null,null,null,1206170101,"ครุภัณฑ์ - Interface"]
[null,null,null,1206170102,"ค่าเสื่อมราคาสะสม-ครุภัณฑ์-Interf."]
[null,null,null,1209030101,"สินทรัพย์ไม่มีตัวตน-Inf"]
[null,null,null,1209030102,"ค่าเสื่อมราคาสะสม-สินทรัพย์ไม่มีตัวตน-Inf"]
[null,null,null,1211010103,"งานระหว่างสร้าง-Inf"]
[null,null,"สินทรัพย์ไม่หมุนเวียนอืน"]
[null,null,null,1213010103,"ค่าใช้จ่ายรอตัดบัญชี"]
["หนี้สิน"]
[null,"หนี้สินหมุนเวียนอื่น "]
[null,null,"เจ้าหนี้ระยะสั้น "]
[null,null,null,2101010107,"เจ้าหนี้การค้า Inf-ภายนอก"]
[null,null,"เงินรับฝากระยะสั้น "]
[null,null,null,2111020199,"เงินรับฝากอื่น"]
[null,null,"เงินประกันอื่น "]
[null,null,null,2112010199,"เงินประกันอื่น"]
[null,null,"หนี้สินหมุนเวียนอื่น "]
[null,null,null,2116010199,"หนี้สินหมุนเวียนอื่น"]
[null,"หนี้สินไม่หมุนเวียนอื่น "]
[null,null,"เงินรับฝากระยะยาว "]
[null,null,null,2207020102,"เงินรับฝากอื่น-ยาว"]
[null,null,null,2208010103,"เงินประกันอื่น-ยาว"]
[null,null,"เจ้าหนี้เงินโอนและรายการอุดหนุนระยะยาว "]
[null,null,null,2213010101,"รายได้รอรับรู้"]
[null,null,"หนี้สินไม่หมุนเวียนอื่น "]
[null,null,null,2213010199,"หนี้สินไม่หมุนฯอื่น"]
["ทุน"]
[null,null,null,3101010101,"รายได้สูง(ต่ำ)ค่าใช้จ่ายสุทธิ"]
[null,null,null,3102010101,"รายได้สูง(ต่ำ)ค่าใช้จ่ายสะสม"]
["รายได้"]
[null,null,"รายได้จากการขายสินค้าและบริการ "]
[null,null,null,4301020107,"รายได้ธรรมเนียมการศึกษา"]
[null,null,"รายได้อื่น "]
[null,null,null,4303010101,"รายได้ดอกเบี้ยเงินฝาก"]
[null,null,null,4306010110,"รายรับจากขายครุภัณฑ์"]
[null,null,null,4313010199,"รายได้อื่น"]
["ค่าใช้จ่าย "]
[null,null,"ค่าใช้จ่ายบุคลากร "]
[null,null,null,5101010101,"เงินเดือน"]
[null,null,null,5101010103,"เงินประจำตำแหน่ง"]
[null,null,null,5101010108,"ค่าล่วงเวลา"]
[null,null,null,5101010199,"เงินเดือน&ค่าจ้างอื่น"]
[null,null,null,5101020106,"เงินสมทบประกันสังคม"]
[null,null,null,5101020108,"ค่าเช่าบ้าน"]
[null,null,null,5101020112,"เงินสมทบกองทุนสำรองเลี้ยงชีพ"]
[null,null,null,5101020113,"ค่าตอบแทนรถประจำตำแหน่ง"]
[null,null,"ค่าตอบแทน "]
[null,null,null,5104040102,"ค่าตอบแทนปฏิบัติงาน "]
[null,null,"ค่าใช้สอย "]
[null,null,"ค่าใช้จ่ายในการฝึกอบรม "]
[null,null,null,5102010106,"ค่าใช้จ่ายทุนการศึกษา-ในประเทศ"]
[null,null,null,5102010199,"ค่าใช้จ่ายอบรม-ในประเทศ"]
[null,null,null,5102020105,"ค่าใช้จ่ายทุนการศึกษา-ต่างประเทศ"]
[null,null,null,5102030199,"ค่าใช้จ่ายฝึกอบรม-ภายนอก"]
[null,null,"ค่าใช้จ่ายในการเดินทาง "]
[null,null,null,5103010102,"ค่าเบี้ยเลี้ยง-ในประเทศ "]
[null,null,null,5103010103,"ค่าที่พัก-ในประเทศ "]
[null,null,null,5103010199,"ค่าใช้จ่ายเดินทางภาย-ในประเทศ"]
[null,null,null,5103020102,"ค่าเบี้ยเลี้ยง-ต่างประเทศ "]
[null,null,null,5103020103,"ค่าที่พัก-ต่างประเทศ"]
[null,null,null,5103020199,"ค่าใช้จ่ายเดินทาง-ต่างประเทศ"]
[null,null,"ค่าซ่อมแซมและบำรุงรักษา "]
[null,null,null,5104010107,"ค่าซ่อมแซม&บำรุงรักษา"]
{"$rows_left_out":30}
{"sheet":"งบทดลอง GFMIS","index":4,"n_rows":75,"n_cols":6,"rows_kept":75,"cut":false,"hidden":false,"merged":[[0,0,0,5],[1,0,1,6],[2,0,2,6],[3,0,3,6],[4,0,4,1]]}
[{"$f":"+'[1]002 ฟอร์มแยกประเภททั่วไป '!A1:K1","v":"มหาวิทยาลัยสวนดุสิต "}]
[{"$f":"+'[1]002 ฟอร์มแยกประเภททั่วไป '!A2:K2","v":"หน่วยงาน............................................................."}]
["งบทดลอง "]
["ประจำ..................................."]
["บัญชีแยกประเภท",null,"ยอดยกมา","เดบิต","เครดิต ","ยอดยกไป"]
[1101010101,"เงินสดในมือ"]
[1101030112,"เงินฝาก-Interface"]
[1102050129,"ลูกหนี้เงินมัดจำ"]
[1102050194,"ลูกหนี้อื่น-ภายนอก"]
[1103020111,"เงินจ่ายล่วงหน้า"]
[1104010104,"เงินฝากประจำ-Inf"]
[1105010105,"วัสดุคงคลัง"]
[1204030101,"ที่ดิน - Interface"]
[1205050101,"อาคาร&สิ่งปลูกสร้าง - Inf"]
[1205050102,"ค่าเสื่อมราคาสะสม-อาคาร&สิ่งปลูกสร้าง-Inf"]
[1206170101,"ครุภัณฑ์ - Interface"]
[1206170102,"ค่าเสื่อมราคาสะสม-ครุภัณฑ์-Interf."]
[1209030101,"สินทรัพย์ไม่มีตัวตน-Inf"]
[1209030102,"ค่าเสื่อมราคาสะสม-สินทรัพย์ไม่มีตัวตน-Inf"]
[1211010103,"งานระหว่างสร้าง-Inf"]
[1213010103,"ค่าใช้จ่ายรอตัดบัญชี"]
[2101010107,"เจ้าหนี้การค้า Inf-ภายนอก"]
[2111020199,"เงินรับฝากอื่น"]
[2112010199,"เงินประกันอื่น"]
[2116010199,"หนี้สินหมุนเวียนอื่น"]
[2207020102,"เงินรับฝากอื่น-ยาว"]
[2208010103,"เงินประกันอื่น-ยาว"]
[2213010101,"รายได้รอรับรู้"]
[2213010199,"หนี้สินไม่หมุนฯอื่น"]
[3101010101,"รายได้สูง(ต่ำ)ค่าใช้จ่ายสุทธิ"]
[3102010101,"รายได้สูง(ต่ำ)ค่าใช้จ่ายสะสม"]
[4301020107,"รายได้ธรรมเนียมการศึกษา"]
[4303010101,"รายได้ดอกเบี้ยเงินฝาก"]
[4306010110,"รายรับจากขายครุภัณฑ์"]
[4313010199,"รายได้อื่น"]
[5101010101,"เงินเดือน"]
[5101010103,"เงินประจำตำแหน่ง"]
[5101010108,"ค่าล่วงเวลา"]
[5101010199,"เงินเดือน&ค่าจ้างอื่น"]
[5101020106,"เงินสมทบประกันสังคม"]
[5101020108,"ค่าเช่าบ้าน"]
[5101020112,"เงินสมทบกองทุนสำรองเลี้ยงชีพ"]
[5101020113,"ค่าตอบแทนรถประจำตำแหน่ง"]
[5102010106,"ค่าใช้จ่ายทุนการศึกษาในประเทศ"]
[5102010199,"ค่าใช้จ่ายอบรมในประเทศ"]
[5102020105,"ค่าใช้จ่ายทุนการศึกษาต่างประเทศ"]
[5102030199,"ค่าใช้จ่ายฝึกอบรม-ภายนอก"]
[5103010102,"ค่าเบี้ยเลี้ยง"]
[5103010103,"ค่าที่พัก"]
[5103010199,"ค่าใช้จ่ายเดินทางภายในประเทศ"]
[5103020102,"ค่าเบี้ยเลี้ยง"]
[5103020103,"ค่าที่พัก"]
[5103020199,"ค่าใช้จ่ายเดินทางต่างประเทศ"]
[5104010104,"ค่าวัสดุ"]
[5104010107,"ค่าซ่อมแซม&บำรุงรักษา"]
[5104010110,"ค่าเชื้อเพลิง"]
[5104010112,"ค่าจ้างเหมาบริการ-ภายนอก"]
[5104020101,"ค่าไฟฟ้า"]
[5104020103,"ค่าประปา&น้ำบาดาล"]
[5104020105,"ค่าโทรศัพท์"]
[5104020106,"ค่าสื่อสาร&โทรคมนาคม"]
[5104020107,"ค่าบริการไปรษณีย์"]
[5104030203,"ค่าเบี้ยประกันภัย"]
[5104030206,"ครุภัณฑ์ต่ำกว่าเกณฑ์"]
[5104030207,"ค่าใช้จ่ายในการประชุม"]
[5104030210,"ค่าเช่าอสังหา- ภายนอก"]
[5104030212,"ค่าเช่าเบ็ดเตล็ด-ภายนอก"]
[5104030216,"ค่าวิจัยและพัฒนา-ภายนอก"]
[5104030219,"ค่าประชาสัมพันธ์"]
[5104030299,"ค่าใช้สอยอื่น ๆ"]
[5104040102,"ค่าตอบแทนการปฏิบัติ"]
[5105010160,"ค่าเสีอมราคา-อาคาร-Interface"]
[5105010161,"ค่าเสือมราคา-ครุภัณฑ์-Interfac"]
[5201020102,"ดอกเบี้ยจ่ายจ่าย-ในประเทศ "]
[null,"รวมทั้งสิ้น "]